Target
Signal transducer and activator of transcription 3
Ligand
BDBM50189926
Substrate
Meas. Tech.
ChEMBL_1591092 (CHEMBL3829060)
IC50
5600±n/a nM
Citation
 LaPorte, MGWang, ZColombo, RGarzan, APeshkov, VALiang, MJohnston, PASchurdak, MESen, MCamarco, DPHua, YPollock, NILazo, JSGrandis, JRWipf, PHuryn, DM Optimization of pyrazole-containing 1,2,4-triazolo-[3,4-b]thiadiazines, a new class of STAT3 pathway inhibitors. Bioorg Med Chem Lett 26:3581-5 (2016)  
Target
Name:
Signal transducer and activator of transcription 3
Synonyms:
APRF STAT3_HUMAN Signal transducer and activator of transcription 3 (STAT3)
Type:
Protein
Mol. Mass.:
88064.31
Organism:
Homo sapiens (Human)
Description:
P40763
Residue:
770
  
Inhibitor
Name:
BDBM50189926
Synonyms:
CHEMBL3828159 US11111253, Compound 6b
Type:
Small organic molecule
Emp. Form.:
C19H13ClN6S
Mol. Mass.:
392.865
SMILES:
Clc1cccc(c1)C1=Nn2c(SC1)nnc2-c1cc(n[nH]1)-c1ccccc1
: