Target
Large neutral amino acids transporter small subunit 3
Ligand
BDBM50190655
Substrate
Meas. Tech.
ChEMBL_1612369 (CHEMBL3854169)
IC50
151200±n/a nM
Citation
 Wibowo, MLevrier, CSadowski, MCNelson, CCWang, QHolst, JHealy, PCHofmann, ADavis, RA Bioactive Dihydro-ß-agarofuran Sesquiterpenoids from the Australian Rainforest Plant Maytenus bilocularis. J Nat Prod 79:1445-53 (2016)  
Target
Name:
Large neutral amino acids transporter small subunit 3
Synonyms:
L-type amino acid transporter 3 LAT3_HUMAN PB39 Prostate cancer overexpressed gene 1 protein Solute carrier family 43 member 1 | Synonyms=LAT3
Type:
PROTEIN
Mol. Mass.:
61481.76
Organism:
Homo sapiens (Human)
Description:
ChEMBL_100162
Residue:
559
  
Inhibitor
Name:
BDBM50190655
Synonyms:
CHEMBL3896908
Type:
Small organic molecule
Emp. Form.:
C28H34O10
Mol. Mass.:
530.5636
SMILES:
[H][C@@]12[C@@H](OC(C)=O)[C@]3(OC1(C)C)[C@H](C)CC[C@H](OC(C)=O)[C@@]3(COC(C)=O)[C@H](OC(=O)c1ccccc1)C2=O
: