Target
Cyclin-dependent kinase 8
Ligand
BDBM50191468
Substrate
Meas. Tech.
ChEMBL_1613002 (CHEMBL3854802)
IC50
800±n/a nM
Citation
 Czodrowski, PMallinger, AWienke, DEsdar, CPöschke, OBusch, MRohdich, FEccles, SAOrtiz-Ruiz, MJSchneider, RRaynaud, FIClarke, PAMusil, DSchwarz, DDale, TUrbahns, KBlagg, JSchiemann, K Structure-Based Optimization of Potent, Selective, and Orally Bioavailable CDK8 Inhibitors Discovered by High-Throughput Screening. J Med Chem 59:9337-9349 (2016)  
Target
Name:
Cyclin-dependent kinase 8
Synonyms:
CDK8 Cell division protein kinase 8 Mediator complex subunit CDK8 Protein kinase K35
Type:
Serine/threonine-protein kinase
Mol. Mass.:
53300.21
Organism:
Homo sapiens (Human)
Description:
P49336
Residue:
464
  
Inhibitor
Name:
BDBM50191468
Synonyms:
CHEMBL3984494
Type:
Small organic molecule
Emp. Form.:
C19H19FN4O
Mol. Mass.:
338.3788
SMILES:
Nc1n[nH]c2ccc(cc12)C(=O)N1CCCC[C@H]1c1ccc(F)cc1
: