Target
DNA repair protein RAD51 homolog 1
Ligand
BDBM50088343
Substrate
Meas. Tech.
ChEMBL_1619495 (CHEMBL3861664)
Kd
1300±n/a nM
Citation
 Johnson, CNErlanson, DAMurray, CWRees, DC Fragment-to-Lead Medicinal Chemistry Publications in 2015. J Med Chem 60:89-99 (2017)  
Target
Name:
DNA repair protein RAD51 homolog 1
Synonyms:
RAD51 RAD51_HUMAN | RECA
Type:
Enzyme Catalytic Domain
Mol. Mass.:
36960.74
Organism:
Homo sapiens (Human)
Description:
gi_49168602
Residue:
339
  
Inhibitor
Name:
BDBM50088343
Synonyms:
CHEMBL3427781
Type:
Small organic molecule
Emp. Form.:
C14H12BrClN2O2S2
Mol. Mass.:
419.744
SMILES:
Clc1sc(cc1Br)S(=O)(=O)NCCc1c[nH]c2ccccc12
: