Target
Fibroblast growth factor receptor 1
Ligand
BDBM50197709
Substrate
Meas. Tech.
ChEMBL_1619701 (CHEMBL3861870)
IC50
1.2±n/a nM
Citation
 Ebiike, HTaka, NMatsushita, MOhmori, MTakami, KHyohdoh, IKohchi, MHayase, TNishii, HMorikami, KNakanishi, YAkiyama, NShindoh, HIshii, NIsobe, TMatsuoka, H Discovery of [5-Amino-1-(2-methyl-3H-benzimidazol-5-yl)pyrazol-4-yl]-(1H-indol-2-yl)methanone (CH5183284/Debio 1347), An Orally Available and Selective Fibroblast Growth Factor Receptor (FGFR) Inhibitor. J Med Chem 59:10586-10600 (2016)  
Target
Name:
Fibroblast growth factor receptor 1
Synonyms:
BFGFR Basic fibroblast growth factor receptor 1 (FGFR1) CEK FGFR-1 FGFR-1, (FL) FGFR1_HUMAN FLT2 Fibroblast growth factor receptor 1 (FGFR-1) Fms-like tyrosine kinase 2 N-sam bFGF-R | c-fgr
Type:
Receptor
Mol. Mass.:
91861.70
Organism:
Homo sapiens (Human)
Description:
P11362
Residue:
822
  
Inhibitor
Name:
BDBM50197709
Synonyms:
CHEMBL3984621
Type:
Small organic molecule
Emp. Form.:
C23H22ClN5O3
Mol. Mass.:
451.905
SMILES:
Nc1c(cnn1-c1cc(O)ccc1Cl)C(=O)c1cc2cc(CN3CCOCC3)ccc2[nH]1
: