Target
Proto-oncogene tyrosine-protein kinase Src
Ligand
BDBM50197713
Substrate
Meas. Tech.
ChEMBL_1619706 (CHEMBL3861875)
IC50
31±n/a nM
Citation
 Ebiike, HTaka, NMatsushita, MOhmori, MTakami, KHyohdoh, IKohchi, MHayase, TNishii, HMorikami, KNakanishi, YAkiyama, NShindoh, HIshii, NIsobe, TMatsuoka, H Discovery of [5-Amino-1-(2-methyl-3H-benzimidazol-5-yl)pyrazol-4-yl]-(1H-indol-2-yl)methanone (CH5183284/Debio 1347), An Orally Available and Selective Fibroblast Growth Factor Receptor (FGFR) Inhibitor. J Med Chem 59:10586-10600 (2016)  
Target
Name:
Proto-oncogene tyrosine-protein kinase Src
Synonyms:
Calmodulin/Proto-oncogene tyrosine-protein kinase Src Proto-oncogene c-Src SRC SRC_HUMAN V-src sarcoma (Schmidt-Ruppin A-2) viral oncogene homolog (avian) p60-Src | pp60c-src
Type:
Protein
Mol. Mass.:
59838.60
Organism:
Homo sapiens (Human)
Description:
P12931
Residue:
536
  
Inhibitor
Name:
BDBM50197713
Synonyms:
CHEMBL3947281
Type:
Small organic molecule
Emp. Form.:
C19H13ClN4O2
Mol. Mass.:
364.785
SMILES:
Nc1c(cnn1-c1cc(O)ccc1Cl)C(=O)c1ccc2ncccc2c1
: