Target
Fibroblast growth factor receptor 4
Ligand
BDBM50197685
Substrate
Meas. Tech.
ChEMBL_1619704 (CHEMBL3861873)
IC50
13±n/a nM
Citation
 Ebiike, HTaka, NMatsushita, MOhmori, MTakami, KHyohdoh, IKohchi, MHayase, TNishii, HMorikami, KNakanishi, YAkiyama, NShindoh, HIshii, NIsobe, TMatsuoka, H Discovery of [5-Amino-1-(2-methyl-3H-benzimidazol-5-yl)pyrazol-4-yl]-(1H-indol-2-yl)methanone (CH5183284/Debio 1347), An Orally Available and Selective Fibroblast Growth Factor Receptor (FGFR) Inhibitor. J Med Chem 59:10586-10600 (2016)  
Target
Name:
Fibroblast growth factor receptor 4
Synonyms:
CD_antigen: CD334 FGFR4 FGFR4 Fibroblast growth factor receptor JK2 TKF
Type:
Protein
Mol. Mass.:
87957.45
Organism:
Homo sapiens (Human)
Description:
P22455
Residue:
802
  
Inhibitor
Name:
BDBM50197685
Synonyms:
CHEMBL3681278 | US10689705, Compound 1
Type:
Small organic molecule
Emp. Form.:
C25H25N7O2
Mol. Mass.:
455.5117
SMILES:
Cc1nc2cc(ccc2[nH]1)-n1ncc(C(=O)c2cc3ccc(CN4CCOCC4)cc3[nH]2)c1N
: