Target
NACHT, LRR and PYD domains-containing protein 3
Ligand
BDBM50199858
Substrate
Meas. Tech.
ChEMBL_1621751 (CHEMBL3864034)
IC50
1238±n/a nM
Citation
 Salla, MButler, MSPelingon, RKaeslin, GCroker, DEReid, JCBaek, JMBernhardt, PVGillam, EMCooper, MARobertson, AA Identification, Synthesis, and Biological Evaluation of the Major Human Metabolite of NLRP3 Inflammasome Inhibitor MCC950. ACS Med Chem Lett 7:1034-1038 (2016)  
Target
Name:
NACHT, LRR and PYD domains-containing protein 3
Synonyms:
C1orf7 NALP3 NLRP3 protein PYPAF1
Type:
Enzyme Catalytic Domain
Mol. Mass.:
118173.88
Organism:
Homo sapiens (Human)
Description:
Q96P20
Residue:
1036
  
Inhibitor
Name:
BDBM50199858
Synonyms:
CHEMBL3956814
Type:
Small organic molecule
Emp. Form.:
C20H24N2O6S
Mol. Mass.:
420.479
SMILES:
CC(C)(O)c1coc(c1)S(=O)(=O)NC(=O)Nc1c2CCCc2cc2[C@H](O)CCc12
: