Target
Proto-oncogene tyrosine-protein kinase Src
Ligand
BDBM50148728
Substrate
Meas. Tech.
ChEMBL_1622697 (CHEMBL3865049)
IC50
>30000±n/a nM
Citation
 Huang, WHulverson, MAZhang, ZChoi, RHart, KJKennedy, MVidadala, RSRMaly, DJVan Voorhis, WCLindner, SEFan, EOjo, KK 5-Aminopyrazole-4-carboxamide analogues are selective inhibitors of Plasmodium falciparum microgametocyte exflagellation and potential malaria transmission blocking agents. Bioorg Med Chem Lett 26:5487-5491 (2016)  
Target
Name:
Proto-oncogene tyrosine-protein kinase Src
Synonyms:
Calmodulin/Proto-oncogene tyrosine-protein kinase Src Proto-oncogene c-Src SRC SRC_HUMAN V-src sarcoma (Schmidt-Ruppin A-2) viral oncogene homolog (avian) p60-Src | pp60c-src
Type:
Protein
Mol. Mass.:
59838.60
Organism:
Homo sapiens (Human)
Description:
P12931
Residue:
536
  
Inhibitor
Name:
BDBM50148728
Synonyms:
CHEMBL3770425 US9956214, Compound 1543
Type:
Small organic molecule
Emp. Form.:
C18H21N5O2
Mol. Mass.:
339.3916
SMILES:
COc1ccc2cc(cnc2c1)-c1nn(c(N)c1C(N)=O)C(C)(C)C
: