Target
C-X-C chemokine receptor type 3
Ligand
BDBM166458
Substrate
Meas. Tech.
ChEMBL_1622750 (CHEMBL3865102)
IC50
44±n/a nM
Citation
 Bata, ITömösközi, ZBuzder-Lantos, PVasas, ASzeleczky, GBátori, SBarta-Bodor, VBalázs, LFerenczy, GG I. Discovery of a novel series of CXCR3 antagonists. Multiparametric optimization of N,N-disubstituted benzylamines. Bioorg Med Chem Lett 26:5418-5428 (2016)  
Target
Name:
C-X-C chemokine receptor type 3
Synonyms:
AAO92295.1 C-X-C chemokine receptor type 3 (CXCR3) CXCR3 CXCR3_HUMAN chemokine (C-X-C motif) receptor 3
Type:
Enzyme Catalytic Domain
Mol. Mass.:
40665.65
Organism:
Homo sapiens (Human)
Description:
Residue:
368
  
Inhibitor
Name:
BDBM166458
Synonyms:
US9073853, 17
Type:
Small organic molecule
Emp. Form.:
C32H40N2O6
Mol. Mass.:
548.6698
SMILES:
CC(N(C[C@H]1CC[C@@H](CC1)C(O)=O)Cc1ccc(OCCN2C(=O)CCC2=O)c(C)c1)c1ccc2OCCc2c1
: