Target
C-X-C chemokine receptor type 3
Ligand
BDBM50200716
Substrate
Meas. Tech.
ChEMBL_1622765 (CHEMBL3865117)
IC50
21±n/a nM
Citation
 Bata, ITömösközi, ZBuzder-Lantos, PVasas, ASzeleczky, GBalázs, LBarta-Bodor, VFerenczy, GG II. Discovery of a novel series of CXCR3 antagonists with a beta amino acid core. Bioorg Med Chem Lett 26:5429-5437 (2016)  
Target
Name:
C-X-C chemokine receptor type 3
Synonyms:
AAO92295.1 C-X-C chemokine receptor type 3 (CXCR3) CXCR3 CXCR3_HUMAN chemokine (C-X-C motif) receptor 3
Type:
Enzyme Catalytic Domain
Mol. Mass.:
40665.65
Organism:
Homo sapiens (Human)
Description:
Residue:
368
  
Inhibitor
Name:
BDBM50200716
Synonyms:
CHEMBL3916386
Type:
Small organic molecule
Emp. Form.:
C26H31ClN2O5
Mol. Mass.:
486.988
SMILES:
CCCN(Cc1ccc(OCCN2C(=O)CCC2=O)c(C)c1)C(CC(O)=O)c1ccc(Cl)cc1
: