Target
C-X-C chemokine receptor type 3
Ligand
BDBM249577
Substrate
Meas. Tech.
ChEMBL_1622765 (CHEMBL3865117)
IC50
23±n/a nM
Citation
 Bata, ITömösközi, ZBuzder-Lantos, PVasas, ASzeleczky, GBalázs, LBarta-Bodor, VFerenczy, GG II. Discovery of a novel series of CXCR3 antagonists with a beta amino acid core. Bioorg Med Chem Lett 26:5429-5437 (2016)  
Target
Name:
C-X-C chemokine receptor type 3
Synonyms:
AAO92295.1 C-X-C chemokine receptor type 3 (CXCR3) CXCR3 CXCR3_HUMAN chemokine (C-X-C motif) receptor 3
Type:
Enzyme Catalytic Domain
Mol. Mass.:
40665.65
Organism:
Homo sapiens (Human)
Description:
Residue:
368
  
Inhibitor
Name:
BDBM249577
Synonyms:
US9447038, 5
Type:
Small organic molecule
Emp. Form.:
C28H34ClN3O6
Mol. Mass.:
544.039
SMILES:
COc1cc(CN(CC(C)C)[C@@H](CC(O)=O)c2ccc(Cl)cc2)ccc1OCCn1c(=O)ccn(C)c1=O
: