Target
Glutamate receptor ionotropic, NMDA 2B
Ligand
BDBM50201027
Substrate
Meas. Tech.
ChEMBL_1622889 (CHEMBL3865241)
IC50
1010±n/a nM
Citation
 Rosse, G Pyrazole Inhibitors of GluN2B NMDA Receptor Subunit. ACS Med Chem Lett 7:1018-1019 (2016)  
Target
Name:
Glutamate receptor ionotropic, NMDA 2B
Synonyms:
GluN2B Grin2b NMDA receptor subunit N2B (GluN2B) NMDE2_RAT | NR2B
Type:
Protein
Mol. Mass.:
166077.66
Organism:
Rattus norvegicus (Rat)
Description:
Q00960
Residue:
1482
  
Inhibitor
Name:
BDBM50201027
Synonyms:
CHEMBL3945735 USRE49517, Example 30
Type:
Small organic molecule
Emp. Form.:
C15H12ClF3N4
Mol. Mass.:
340.731
SMILES:
Cn1ccc(Cn2cc(cn2)-c2ccc(Cl)c(c2)C(F)(F)F)n1
: