Target
Phosphatidylinositol 4,5-bisphosphate 3-kinase catalytic subunit delta isoform
Ligand
BDBM50202260
Substrate
Meas. Tech.
ChEBML_1623998
IC50
9100±n/a nM
Citation
 Zheng, ZPinson, JAMountford, SJOrive, SSchoenwaelder, SMShackleford, DPowell, ANelson, EMHamilton, JRJackson, SPJennings, IGThompson, PE Discovery and antiplatelet activity of a selective PI3Kß inhibitor (MIPS-9922). Eur J Med Chem 122:339-351 (2016)  
Target
Name:
Phosphatidylinositol 4,5-bisphosphate 3-kinase catalytic subunit delta isoform
Synonyms:
PI3-kinase p110 subunit delta PI3-kinase subunit p110-delta PIK3CD Phosphatidylinositol 4,5-biphosphate 3-kinase catalytic subunit delta (PIK3CD) Phosphatidylinositol 4,5-bisphosphate 3-kinase 110 kDa catalytic subunit delta (PI3K delta) Phosphatidylinositol 4,5-bisphosphate 3-kinase catalytic subunit delta (PI3Kdelta) Phosphatidylinositol 4,5-bisphosphate 3-kinase catalytic subunit delta isoform (PI3K delta) Phosphatidylinositol 4,5-bisphosphate 3-kinase catalytic subunit delta isoform (PI3K-delta) Phosphatidylinositol 4,5-bisphosphate 3-kinase catalytic subunit delta isoform (PI3Kdelta)
Type:
Enzyme Subunit
Mol. Mass.:
119489.41
Organism:
Homo sapiens (Human)
Description:
O00329
Residue:
1044
  
Inhibitor
Name:
BDBM50202260
Synonyms:
CHEMBL3944869
Type:
Small organic molecule
Emp. Form.:
C26H35F2N9O2
Mol. Mass.:
543.612
SMILES:
CC(C)C[C@H](N)CC(=O)N1CCN(CC1)c1nc(nc(n1)-n1c(nc2ccccc12)C(F)F)N1CCOCC1
: