Target
Cannabinoid receptor 1
Ligand
BDBM50202518
Substrate
Meas. Tech.
ChEMBL_1624519 (CHEMBL3866931)
Ki
>10000±n/a nM
Citation
 Osman, NALigresti, AKlein, CDAllarà, MRabbito, ADi Marzo, VAbouzid, KAAbadi, AH Discovery of novel Tetrahydrobenzo[b]thiophene and pyrrole based scaffolds as potent and selective CB2 receptor ligands: The structural elements controlling binding affinity, selectivity and functionality. Eur J Med Chem 122:619-634 (2016)  
Target
Name:
Cannabinoid receptor 1
Synonyms:
CANN6 CB-R CNR CNR1_HUMAN Cannabinoid receptor Cannabinoid receptor 1 (brain)
Type:
G Protein-Coupled Receptor (GPCR)
Mol. Mass.:
52868.96
Organism:
Homo sapiens (Human)
Description:
P21554
Residue:
472
  
Inhibitor
Name:
BDBM50202518
Synonyms:
CHEMBL3946002
Type:
Small organic molecule
Emp. Form.:
C19H17NO4S2
Mol. Mass.:
387.473
SMILES:
CCOC(=O)c1cc(sc1NS(=O)(=O)c1ccccc1)-c1ccccc1
: