Target
Proto-oncogene tyrosine-protein kinase receptor Ret
Ligand
BDBM50203448
Substrate
Meas. Tech.
ChEMBL_1625725 (CHEMBL3868194)
IC50
342±n/a nM
Citation
 Han, MLi, SAi, JSheng, RHu, YHu, YGeng, M Discovery of 4-chloro-3-(5-(pyridin-3-yl)-1,2,4-oxadiazole-3-yl)benzamides as novel RET kinase inhibitors. Bioorg Med Chem Lett 26:5679-5684 (2016)  
Target
Name:
Proto-oncogene tyrosine-protein kinase receptor Ret
Synonyms:
CDHF12 Cadherin family member 12 Proto-oncogene c-Ret RET51 Tyrosine-protein kinase Ret (RET)
Type:
Protein
Mol. Mass.:
124318.29
Organism:
Homo sapiens (Human)
Description:
P07949
Residue:
1114
  
Inhibitor
Name:
BDBM50203448
Synonyms:
CHEMBL3961567
Type:
Small organic molecule
Emp. Form.:
C28H26ClF3N6O3
Mol. Mass.:
586.993
SMILES:
COc1ccc(cn1)-c1nc(no1)-c1cc(ccc1Cl)C(=O)Nc1ccc(CN2CCN(C)CC2)c(c1)C(F)(F)F
: