Target
Proto-oncogene tyrosine-protein kinase receptor Ret
Ligand
BDBM50203454
Substrate
Meas. Tech.
ChEMBL_1625725 (CHEMBL3868194)
IC50
7.3±n/a nM
Citation
 Han, MLi, SAi, JSheng, RHu, YHu, YGeng, M Discovery of 4-chloro-3-(5-(pyridin-3-yl)-1,2,4-oxadiazole-3-yl)benzamides as novel RET kinase inhibitors. Bioorg Med Chem Lett 26:5679-5684 (2016)  
Target
Name:
Proto-oncogene tyrosine-protein kinase receptor Ret
Synonyms:
CDHF12 Cadherin family member 12 Proto-oncogene c-Ret RET51 Tyrosine-protein kinase Ret (RET)
Type:
Protein
Mol. Mass.:
124318.29
Organism:
Homo sapiens (Human)
Description:
P07949
Residue:
1114
  
Inhibitor
Name:
BDBM50203454
Synonyms:
CHEMBL3961612
Type:
Small organic molecule
Emp. Form.:
C27H24ClF3N6O2
Mol. Mass.:
556.967
SMILES:
CN1CCN(Cc2ccc(NC(=O)c3ccc(Cl)c(c3)-c3noc(n3)-c3cccnc3)cc2C(F)(F)F)CC1
: