Target
Coiled-coil domain-containing protein 6
Ligand
BDBM50203455
Substrate
Meas. Tech.
ChEMBL_1625726 (CHEMBL3868195)
IC50
407±n/a nM
Citation
 Han, MLi, SAi, JSheng, RHu, YHu, YGeng, M Discovery of 4-chloro-3-(5-(pyridin-3-yl)-1,2,4-oxadiazole-3-yl)benzamides as novel RET kinase inhibitors. Bioorg Med Chem Lett 26:5679-5684 (2016)  
Target
Name:
Coiled-coil domain-containing protein 6
Synonyms:
CCDC6 Coiled-coil domain-containing protein 6 Papillary thyroid carcinoma-encoded protein TST1
Type:
PROTEIN
Mol. Mass.:
53294.85
Organism:
Homo sapiens (Human)
Description:
ChEMBL_109661
Residue:
474
  
Inhibitor
Name:
BDBM50203455
Synonyms:
CHEMBL3906151
Type:
Small organic molecule
Emp. Form.:
C31H28ClF3N8O2
Mol. Mass.:
637.055
SMILES:
CN1CCN(Cc2ccc(NC(=O)c3ccc(Cl)c(c3)-c3noc(n3)-c3cncc(c3)-c3cnn(C)c3)cc2C(F)(F)F)CC1
: