Target
Prostaglandin G/H synthase 1
Ligand
BDBM50204327
Substrate
Meas. Tech.
ChEMBL_1627350 (CHEMBL3869871)
IC50
374000±n/a nM
Citation
 Swiatek, PStrzelecka, MUrniaz, RGebczak, KGebarowski, TGasiorowski, KMalinka, W Synthesis, COX-1/2 inhibition activities and molecular docking study of isothiazolopyridine derivatives. Bioorg Med Chem 25:316-326 (2017)  
Target
Name:
Prostaglandin G/H synthase 1
Synonyms:
COX-1 Cyclooxygenase Cyclooxygenase-1 (COX-1) PTGS1 | Prostaglandin G/H synthase (cyclooxygenase)
Type:
Enzyme
Mol. Mass.:
68692.62
Organism:
Homo sapiens (Human)
Description:
P23219
Residue:
599
  
Inhibitor
Name:
BDBM50204327
Synonyms:
CHEMBL3906347
Type:
Small organic molecule
Emp. Form.:
C20H21ClN4O2S
Mol. Mass.:
416.924
SMILES:
Cc1cc(C)c2c(n1)sn(CC(=O)N1CCN(CC1)c1cccc(Cl)c1)c2=O
: