Target
Prostaglandin G/H synthase 1
Ligand
BDBM50204360
Substrate
Meas. Tech.
ChEMBL_1627350 (CHEMBL3869871)
IC50
218900±n/a nM
Citation
 Swiatek, PStrzelecka, MUrniaz, RGebczak, KGebarowski, TGasiorowski, KMalinka, W Synthesis, COX-1/2 inhibition activities and molecular docking study of isothiazolopyridine derivatives. Bioorg Med Chem 25:316-326 (2017)  
Target
Name:
Prostaglandin G/H synthase 1
Synonyms:
COX-1 Cyclooxygenase Cyclooxygenase-1 (COX-1) PTGS1 | Prostaglandin G/H synthase (cyclooxygenase)
Type:
Enzyme
Mol. Mass.:
68692.62
Organism:
Homo sapiens (Human)
Description:
P23219
Residue:
599
  
Inhibitor
Name:
BDBM50204360
Synonyms:
CHEMBL3974473
Type:
Small organic molecule
Emp. Form.:
C18H22N4OS
Mol. Mass.:
342.458
SMILES:
CN(CCNc1ccccc1)Cn1sc2nc(C)cc(C)c2c1=O
: