Target
Prostaglandin G/H synthase 2
Ligand
BDBM50204362
Substrate
Meas. Tech.
ChEMBL_1627348 (CHEMBL3869869)
IC50
343000±n/a nM
Citation
 Swiatek, PStrzelecka, MUrniaz, RGebczak, KGebarowski, TGasiorowski, KMalinka, W Synthesis, COX-1/2 inhibition activities and molecular docking study of isothiazolopyridine derivatives. Bioorg Med Chem 25:316-326 (2017)  
Target
Name:
Prostaglandin G/H synthase 2
Synonyms:
COX2 Cyclooxygenase 2 (COX-2) Cyclooxygenase-2 (COX-2 AA) Cyclooxygenase-2 (COX-2) PGH2_HUMAN PHS II Prostaglandin E synthase/G/H synthase 2 Prostaglandin-endoperoxide synthase 2
Type:
Enzyme
Mol. Mass.:
69003.89
Organism:
Homo sapiens (Human)
Description:
Recombinant Cox-2 provided by Cayman (Cayman Chemical Co.,Ann Arbor, MI).
Residue:
604
  
Inhibitor
Name:
BDBM50204362
Synonyms:
CHEMBL3977032
Type:
Small organic molecule
Emp. Form.:
C22H26N4O2S
Mol. Mass.:
410.532
SMILES:
CCC(C(=O)N1CCN(CC1)c1ccccc1)n1sc2nc(C)cc(C)c2c1=O
: