Target
Epidermal growth factor receptor
Ligand
BDBM50204614
Substrate
Meas. Tech.
ChEBML_1627833
IC50
898±n/a nM
Citation
 Wang, YZhang, GHu, GBu, YLei, HZuo, DHan, MZhai, XGong, P Design, synthesis and biological evaluation of novel 4-arylaminopyrimidine derivatives possessing a hydrazone moiety as dual inhibitors of L1196M ALK and ROS1. Eur J Med Chem 123:80-89 (2016)  
Target
Name:
Epidermal growth factor receptor
Synonyms:
EGF Receptor Substrate EGFR_HUMAN ERBB1 Epidermal Growth Factor Receptor erbB-1 Epidermal growth factor receptor (EGFR) HER1 Proto-oncogene c-ErbB-1 Tyrosine-Protein Kinase ErbB-1
Type:
Receptor Kinase Domain
Mol. Mass.:
134279.59
Organism:
Homo sapiens (Human)
Description:
P00533
Residue:
1210
  
Inhibitor
Name:
BDBM50204614
Synonyms:
CHEMBL3913728
Type:
Small organic molecule
Emp. Form.:
C21H19ClF3N5O3S
Mol. Mass.:
513.92
SMILES:
CC(C)S(=O)(=O)c1ccccc1Nc1nc(N\N=C\c2ccc(OC(F)(F)F)cc2)ncc1Cl
: