Target
Proto-oncogene tyrosine-protein kinase ROS
Ligand
BDBM50204614
Substrate
Meas. Tech.
ChEMBL_1627831 (CHEMBL3870416)
IC50
5.5±n/a nM
Citation
 Wang, YZhang, GHu, GBu, YLei, HZuo, DHan, MZhai, XGong, P Design, synthesis and biological evaluation of novel 4-arylaminopyrimidine derivatives possessing a hydrazone moiety as dual inhibitors of L1196M ALK and ROS1. Eur J Med Chem 123:80-89 (2016)  
Target
Name:
Proto-oncogene tyrosine-protein kinase ROS
Synonyms:
MCF3 Proto-oncogene c-Ros-1 ROS1 Receptor tyrosine kinase c-ros oncogene 1 c-Ros receptor tyrosine kinase
Type:
Enzyme
Mol. Mass.:
263897.39
Organism:
Homo sapiens (Human)
Description:
P08922
Residue:
2347
  
Inhibitor
Name:
BDBM50204614
Synonyms:
CHEMBL3913728
Type:
Small organic molecule
Emp. Form.:
C21H19ClF3N5O3S
Mol. Mass.:
513.92
SMILES:
CC(C)S(=O)(=O)c1ccccc1Nc1nc(N\N=C\c2ccc(OC(F)(F)F)cc2)ncc1Cl
: