Target
Prostacyclin receptor
Ligand
BDBM50206015
Substrate
Meas. Tech.
ChEMBL_1628614 (CHEMBL3871199)
EC50
>10000±n/a nM
Citation
 Sugimoto, IKambe, TOkino, TObitsu, TOhta, NNishiyama, TKinoshita, AFujimoto, TEgashira, HYamane, SShuto, STani, KMaruyama, T Discovery of Novel Seven-Membered Prostacyclin Analogues as Potent and Selective Prostaglandin FP and EP3 Dual Agonists. ACS Med Chem Lett 8:107-112 (2017)  
Target
Name:
Prostacyclin receptor
Synonyms:
PGI receptor PRIPR Prostacyclin (IP) Receptor Prostaglandin I Prostaglandin I2 receptor | Prostanoid IP receptor
Type:
G Protein-Coupled Receptor (GPCR)
Mol. Mass.:
40968.22
Organism:
Homo sapiens (Human)
Description:
The membranes prepared from human platelet were used in binding assay.
Residue:
386
  
Inhibitor
Name:
BDBM50206015
Synonyms:
CHEMBL3984438
Type:
Small organic molecule
Emp. Form.:
C22H30O6
Mol. Mass.:
390.47
SMILES:
[H][C@]12C[C@@H](O)[C@H](\C=C\[C@@H](O)COc3ccccc3)[C@@]1([H])CC[C@@H](CCC(O)=O)CO2
: