Target
Tyrosine-protein kinase JAK2
Ligand
BDBM50208588
Substrate
Meas. Tech.
ChEMBL_1633046 (CHEMBL3875838)
IC50
129±n/a nM
Citation
 Phuangsawai, OBeswick, PRatanabunyong, STabtimmai, LSuphakun, PObounchoey, PSrisook, PHorata, NChuckowree, IHannongbua, SWard, SEChoowongkomon, KGleeson, MP Evaluation of the anti-malarial activity and cytotoxicity of 2,4-diamino-pyrimidine-based kinase inhibitors. Eur J Med Chem 124:896-905 (2016)  
Target
Name:
Tyrosine-protein kinase JAK2
Synonyms:
JAK-2 JAK2_HUMAN Janus kinase 2 (JAK2) | Janus kinase 2 (a protein tyrosine kinase)
Type:
Protein
Mol. Mass.:
130684.68
Organism:
Homo sapiens (Human)
Description:
O60674
Residue:
1132
  
Inhibitor
Name:
BDBM50208588
Synonyms:
CHEMBL3884240
Type:
Small organic molecule
Emp. Form.:
C20H22N6O3S
Mol. Mass.:
426.492
SMILES:
NS(=O)(=O)c1cccc(Nc2ccnc(Nc3ccc(cc3)N3CCOCC3)n2)c1
: