Target
Tyrosine-protein kinase JAK3
Ligand
BDBM50208589
Substrate
Meas. Tech.
ChEMBL_1633047 (CHEMBL3875839)
IC50
1800±n/a nM
Citation
 Phuangsawai, OBeswick, PRatanabunyong, STabtimmai, LSuphakun, PObounchoey, PSrisook, PHorata, NChuckowree, IHannongbua, SWard, SEChoowongkomon, KGleeson, MP Evaluation of the anti-malarial activity and cytotoxicity of 2,4-diamino-pyrimidine-based kinase inhibitors. Eur J Med Chem 124:896-905 (2016)  
Target
Name:
Tyrosine-protein kinase JAK3
Synonyms:
JAK-3 JAK3_HUMAN Janus kinase 3 (JAK3) L-JAK | Leukocyte janus kinase
Type:
Protein
Mol. Mass.:
125111.08
Organism:
Homo sapiens (Human)
Description:
P52333
Residue:
1124
  
Inhibitor
Name:
BDBM50208589
Synonyms:
CHEMBL3884848
Type:
Small organic molecule
Emp. Form.:
C23H28N6
Mol. Mass.:
388.5086
SMILES:
CN1CCN(CC1)c1ccc(Nc2nccc(Nc3cccc(C)c3)n2)cc1C
: