Target
Tyrosine-protein kinase JAK2
Ligand
BDBM50208590
Substrate
Meas. Tech.
ChEMBL_1633046 (CHEMBL3875838)
IC50
126±n/a nM
Citation
 Phuangsawai, OBeswick, PRatanabunyong, STabtimmai, LSuphakun, PObounchoey, PSrisook, PHorata, NChuckowree, IHannongbua, SWard, SEChoowongkomon, KGleeson, MP Evaluation of the anti-malarial activity and cytotoxicity of 2,4-diamino-pyrimidine-based kinase inhibitors. Eur J Med Chem 124:896-905 (2016)  
Target
Name:
Tyrosine-protein kinase JAK2
Synonyms:
JAK-2 JAK2_HUMAN Janus kinase 2 (JAK2) | Janus kinase 2 (a protein tyrosine kinase)
Type:
Protein
Mol. Mass.:
130684.68
Organism:
Homo sapiens (Human)
Description:
O60674
Residue:
1132
  
Inhibitor
Name:
BDBM50208590
Synonyms:
CHEMBL3884104
Type:
Small organic molecule
Emp. Form.:
C22H27N7O2S
Mol. Mass.:
453.56
SMILES:
CN1CCN(CC1)c1ccc(Nc2nccc(Nc3cccc(c3)S(N)(=O)=O)n2)cc1C
: