Target
Epidermal growth factor receptor
Ligand
BDBM50208589
Substrate
Meas. Tech.
ChEMBL_1633048 (CHEMBL3875840)
IC50
>150000±n/a nM
Citation
 Phuangsawai, OBeswick, PRatanabunyong, STabtimmai, LSuphakun, PObounchoey, PSrisook, PHorata, NChuckowree, IHannongbua, SWard, SEChoowongkomon, KGleeson, MP Evaluation of the anti-malarial activity and cytotoxicity of 2,4-diamino-pyrimidine-based kinase inhibitors. Eur J Med Chem 124:896-905 (2016)  
Target
Name:
Epidermal growth factor receptor
Synonyms:
EGF Receptor Substrate EGFR_HUMAN ERBB1 Epidermal Growth Factor Receptor erbB-1 Epidermal growth factor receptor (EGFR) HER1 Proto-oncogene c-ErbB-1 Tyrosine-Protein Kinase ErbB-1
Type:
Receptor Kinase Domain
Mol. Mass.:
134279.59
Organism:
Homo sapiens (Human)
Description:
P00533
Residue:
1210
  
Inhibitor
Name:
BDBM50208589
Synonyms:
CHEMBL3884848
Type:
Small organic molecule
Emp. Form.:
C23H28N6
Mol. Mass.:
388.5086
SMILES:
CN1CCN(CC1)c1ccc(Nc2nccc(Nc3cccc(C)c3)n2)cc1C
: