Target
Free fatty acid receptor 1
Ligand
BDBM50210147
Substrate
Meas. Tech.
ChEMBL_1634352 (CHEMBL3877144)
EC50
296±n/a nM
Target
Name:
Free fatty acid receptor 1
Synonyms:
FFAR1 G-protein Coupled Receptor 40 | GPR40
Type:
G Protein-Coupled Receptor (GPCR)
Mol. Mass.:
31473.32
Organism:
Homo sapiens (Human)
Description:
O14842
Residue:
300
  
Inhibitor
Name:
BDBM50210147
Synonyms:
CHEMBL3884916
Type:
Small organic molecule
Emp. Form.:
C29H26FNO4
Mol. Mass.:
471.5194
SMILES:
COc1ccc(F)c(c1)-c1ccc(cc1C#N)C1CCc2ccc(cc2O1)[C@@H](CC(O)=O)C1CC1
: