Target
Free fatty acid receptor 1
Ligand
BDBM50210158
Substrate
Meas. Tech.
ChEMBL_1634352 (CHEMBL3877144)
EC50
2.6±n/a nM
Target
Name:
Free fatty acid receptor 1
Synonyms:
FFAR1 G-protein Coupled Receptor 40 | GPR40
Type:
G Protein-Coupled Receptor (GPCR)
Mol. Mass.:
31473.32
Organism:
Homo sapiens (Human)
Description:
O14842
Residue:
300
  
Inhibitor
Name:
BDBM50210158
Synonyms:
CHEMBL3883380
Type:
Small organic molecule
Emp. Form.:
C29H29FO4
Mol. Mass.:
460.5366
SMILES:
COc1ccc(F)c(c1)-c1ccc(cc1)[C@H]1CCc2ccc(cc2O1)[C@@H]([C@H](C)C(O)=O)C1CC1
: