Target
Neuronal acetylcholine receptor subunit alpha-3/beta-2
Ligand
BDBM50216347
Substrate
Meas. Tech.
ChEMBL_1634648 (CHEMBL3877546)
Ki
3.1±n/a nM
Citation
 Zhang, HKEaton, JBFedolak, AGunosewoyo, HOnajole, OKBrunner, DLukas, RJYu, LFKozikowski, AP Synthesis and biological evaluation of novel hybrids of highly potent and selectivea4ß2-Nicotinic acetylcholine receptor (nAChR) partial agonists. Eur J Med Chem 124:689-697 (2016)  
Target
Name:
Neuronal acetylcholine receptor subunit alpha-3/beta-2
Synonyms:
Neuronal acetylcholine receptor Alpha-3/Beta-2 Neuronal acetylcholine receptor; alpha3/beta2 | nAChR subtypes alpha3 beta2
Type:
Protein
Mol. Mass.:
Description:
Components:
This complex has 2 components.
Component 1
Name:
Neuronal acetylcholine receptor subunit alpha-3
Synonyms:
ACHA3_RAT Chrna3
Type:
Enzyme
Mol. Mass.:
56995.52
Organism:
Rattus norvegicus (Rat)
Description:
P04757
Residue:
499
  
Component 2
Name:
Neuronal acetylcholine receptor subunit beta-2
Synonyms:
ACHB2_RAT Chrnb2 Neuronal acetylcholine receptor non-alpha-1 chain
Type:
Enzyme
Mol. Mass.:
56910.32
Organism:
Rattus norvegicus (Rat)
Description:
P12390
Residue:
500
  
Inhibitor
Name:
BDBM50216347
Synonyms:
(1R,4R)-2-(3-pyridinyl)-2,5-diazabicyclo[2.2.1]heptane 2-(pyridin-3-yl)-2,5-diazabicyclo[2.2.1]heptane | CHEMBL389964
Type:
Small organic molecule
Emp. Form.:
C10H13N3
Mol. Mass.:
175.2303
SMILES:
C1NC2CC1N(C2)c1cccnc1
: