Target
Aromatase
Ligand
BDBM50210931
Substrate
Meas. Tech.
ChEMBL_1635524 (CHEMBL3878422)
IC50
5089±n/a nM
Citation
 Ghorab, MMAlsaid, MSAl-Ansary, GHAbdel-Latif, GAAbou El Ella, DA Analogue based drug design, synthesis, molecular docking and anticancer evaluation of novel chromene sulfonamide hybrids as aromatase inhibitors and apoptosis enhancers. Eur J Med Chem 124:946-958 (2016)  
Target
Name:
Aromatase
Synonyms:
ARO1 CP19A_HUMAN CYP19 CYPXIX Cytochrome P450 19A1 Cytochrome P450-C19 (CYP19) FL cytokine receptor precursor | P-450AROM
Type:
Enzyme
Mol. Mass.:
57888.92
Organism:
Homo sapiens (Human)
Description:
P11511
Residue:
503
  
Inhibitor
Name:
BDBM50210931
Synonyms:
CHEMBL3959541
Type:
Small organic molecule
Emp. Form.:
C27H20N4O5S
Mol. Mass.:
512.536
SMILES:
O=C(\C=C/Nc1ccc(cc1)S(=O)(=O)Nc1ccnn1-c1ccccc1)c1cc2ccccc2oc1=O
: