Target
Methionine aminopeptidase 2
Ligand
BDBM50211290
Substrate
Meas. Tech.
ChEMBL_1636404 (CHEMBL3879302)
IC50
>15000±n/a nM
Citation
 Helgren, TRChen, CWangtrakuldee, PEdwards, TEStaker, BLAbendroth, JSankaran, BHousley, NAMyler, PJAudia, JPHorn, JRHagen, TJ Rickettsia prowazekii methionine aminopeptidase as a promising target for the development of antibacterial agents. Bioorg Med Chem 25:813-824 (2017)  
Target
Name:
Methionine aminopeptidase 2
Synonyms:
Initiation factor 2-associated 67 kDa glycoprotein MAP2_HUMAN MNPEP Methionine aminopeptidase 2 (MetAP2) P67EIF2 p67
Type:
Enzyme
Mol. Mass.:
52884.45
Organism:
Homo sapiens (Human)
Description:
P50579
Residue:
478
  
Inhibitor
Name:
BDBM50211290
Synonyms:
CHEMBL2407096
Type:
Small organic molecule
Emp. Form.:
C13H18N4S
Mol. Mass.:
262.374
SMILES:
CC(C)(C)c1ccc(CSc2nnc(N)[nH]2)cc1
: