Target
Methionine aminopeptidase 1
Ligand
BDBM50211290
Substrate
Meas. Tech.
ChEMBL_1636403 (CHEMBL3879301)
IC50
>15000±n/a nM
Citation
 Helgren, TRChen, CWangtrakuldee, PEdwards, TEStaker, BLAbendroth, JSankaran, BHousley, NAMyler, PJAudia, JPHorn, JRHagen, TJ Rickettsia prowazekii methionine aminopeptidase as a promising target for the development of antibacterial agents. Bioorg Med Chem 25:813-824 (2017)  
Target
Name:
Methionine aminopeptidase 1
Synonyms:
Aminopeptidase MAP 1 METAP1 Methionine Aminopeptidase Type 1 (MetAP1) | Peptidase M 1
Type:
Enzyme
Mol. Mass.:
43220.79
Organism:
Homo sapiens (Human)
Description:
MetAP1 with an N-terminal six histidine tag was expressed in baculovirus infected sf9 cells.
Residue:
386
  
Inhibitor
Name:
BDBM50211290
Synonyms:
CHEMBL2407096
Type:
Small organic molecule
Emp. Form.:
C13H18N4S
Mol. Mass.:
262.374
SMILES:
CC(C)(C)c1ccc(CSc2nnc(N)[nH]2)cc1
: