Target
DNA gyrase subunit A
Ligand
BDBM50211474
Substrate
Meas. Tech.
ChEMBL_1636458 (CHEMBL3879356)
IC50
524±n/a nM
Citation
 Alagumuthu, MArumugam, S Molecular docking, discovery, synthesis, and pharmacological properties of new 6-substituted-2-(3-phenoxyphenyl)-4-phenyl quinoline derivatives; an approach to developing potent DNA gyrase inhibitors/antibacterial agents. Bioorg Med Chem 25:1448-1455 (2017)  
Target
Name:
DNA gyrase subunit A
Synonyms:
DNA gyrase subunit A (gyrA) gyrA
Type:
Enzyme Subunit
Mol. Mass.:
99588.82
Organism:
Staphylococcus aureus
Description:
Residue:
889
  
Inhibitor
Name:
BDBM50211474
Synonyms:
CHEMBL3889861
Type:
Small organic molecule
Emp. Form.:
C27H18ClNO
Mol. Mass.:
407.891
SMILES:
Clc1ccc2nc(cc(-c3ccccc3)c2c1)-c1cccc(Oc2ccccc2)c1
: