Target
Beta-lactamase OXA-1
Ligand
BDBM50212636
Substrate
Meas. Tech.
ChEMBL_40708 (CHEMBL654920)
IC50
1580±n/a nM
Citation
  TBA Bioorg Med Chem Lett 3:2247-2252 (1993)   
Target
Name:
Beta-lactamase OXA-1
Synonyms:
BLO1_ECOLX Class D β-lactamase (OXA-1) oxa1
Type:
Enzyme
Mol. Mass.:
30882.83
Organism:
Escherichia coli (Enterobacteria)
Description:
Q83ZU9
Residue:
276
  
Inhibitor
Name:
BDBM50212636
Synonyms:
CHEMBL310221
Type:
Small organic molecule
Emp. Form.:
C11H13BrN2O3S3
Mol. Mass.:
397.332
SMILES:
[H][C@]12S[C@@](C)(CSC3=NCCS3)[C@@H](N1C(=O)[C@H]2Br)C(O)=O
: