Target
DNA gyrase subunit A/B
Ligand
BDBM50049391
Substrate
Meas. Tech.
ChEMBL_75871 (CHEMBL687258)
IC50
>1850000±n/a nM
Citation
  TBA Bioorg Med Chem Lett 3:225-230 (1993)   
Target
Name:
DNA gyrase subunit A/B
Synonyms:
DNA Gyrase | DNA gyrase A/B
Type:
A2B2 tetramer
Mol. Mass.:
Description:
Components:
This complex has 2 components.
Component 1
Name:
DNA gyrase subunit A
Synonyms:
DNA gyrase GYRA_ECOLI hisW parD
Type:
Enzyme Subunit
Mol. Mass.:
96935.15
Organism:
Escherichia coli (strain K12)
Description:
Residue:
875
  
Component 2
Name:
DNA gyrase subunit B
Synonyms:
DNA gyrase subunit B GYRB_ECOLI acrB gyrB hisU parA | pcbA
Type:
Enzyme Subunit
Mol. Mass.:
89941.28
Organism:
Escherichia coli (strain K12)
Description:
P0AES6
Residue:
804
  
Inhibitor
Name:
BDBM50049391
Synonyms:
3,5,7-Trihydroxyflavone 3,5,7-trihydroxy-2-phenyl-4H-benzopyran-4-one CHEMBL309490 Galangin (15) cid_5281616 | norizalpinin
Type:
Small organic molecule
Emp. Form.:
C15H10O5
Mol. Mass.:
270.2369
SMILES:
Oc1cc(O)c2c(c1)oc(-c1ccccc1)c(O)c2=O
: