Target
Melatonin receptor type 1C
Ligand
BDBM50282765
Substrate
Meas. Tech.
ChEMBL_104756 (CHEMBL712439)
Ki
0.970000±n/a nM
Citation
  TBA Bioorg Med Chem Lett 4:1559-1564 (1994)   
Target
Name:
Melatonin receptor type 1C
Synonyms:
CKB Mel-1C-R Melatonin receptor type 1C
Type:
PROTEIN
Mol. Mass.:
38595.98
Organism:
Gallus gallus
Description:
ChEMBL_104739
Residue:
346
  
Inhibitor
Name:
BDBM50282765
Synonyms:
CHEMBL38728 | N-(6-Methoxy-9-methyl-2,3,4,9-tetrahydro-1H-carbazol-4-yl)-acetamide
Type:
Small organic molecule
Emp. Form.:
C16H20N2O2
Mol. Mass.:
272.3422
SMILES:
COc1ccc2n(C)c3CCCC(NC(C)=O)c3c2c1
: