Target
Phenylethanolamine N-methyltransferase
Ligand
BDBM50052884
Substrate
Meas. Tech.
ChEMBL_153318 (CHEMBL760054)
Ki
2.48E+3±n/a nM
Citation
 Grunewald, GLCaldwell, TMDahanukar, VHJalluri, RKCriscione, KR Comparative molecular field analysis (CoMFA) models of phenylethanolamine N-methyltransferase (PNMT) and the alpha2-adrenoceptor: the development of new, highly selective inhibitors of PNMT. Bioorg Med Chem Lett 9:481-6 (1999)  
Target
Name:
Phenylethanolamine N-methyltransferase
Synonyms:
Noradrenaline N-methyltransferase PNMT_BOVIN | PNMTase
Type:
Enzyme
Mol. Mass.:
30916.97
Organism:
Bos taurus (bovine)
Description:
Residue:
283
  
Inhibitor
Name:
BDBM50052884
Synonyms:
(S)-3-Methyl-1,2,3,4-tetrahydro-isoquinoline | CHEMBL294079
Type:
Small organic molecule
Emp. Form.:
C10H13N
Mol. Mass.:
147.2169
SMILES:
C[C@H]1Cc2ccccc2CN1
: