Target
5-hydroxytryptamine receptor 2C
Ligand
BDBM50321863
Substrate
Meas. Tech.
ChEMBL_2760 (CHEMBL617757)
Ki
6.3±n/a nM
Citation
 Bromidge, SMDabbs, SDavies, SDuckworth, DMForbes, ITJones, GEJones, JKing, FDSaunders, DVBlackburn, TPHolland, VKennett, GALightowler, SMiddlemiss, DNRiley, GJTrail, BWood, MD 1-[2-[(Heteroaryloxy)heteroaryl]carbamoyl]indolines: novel and selective 5-HT2C receptor inverse agonists with potential as antidepressant/anxiolytic agents. Bioorg Med Chem Lett 10:1863-6 (2000)  
Target
Name:
5-hydroxytryptamine receptor 2C
Synonyms:
5-HT-1C 5-HT1C 5-HT2C-INI 5-HTR2C 5-hydroxytryptamine receptor 2C (5-HT-2C) 5HT-1C HTR1C Serotonin (5-HT3) receptor Serotonin Receptor 2C
Type:
G Protein-Coupled Receptor (GPCR)
Mol. Mass.:
51836.79
Organism:
Homo sapiens (Human)
Description:
P28335
Residue:
458
  
Inhibitor
Name:
BDBM50321863
Synonyms:
5-Chloro-2,3-dihydro-indole-1-carboxylic acid [6-(2-methyl-pyridin-3-yloxy)-pyridin-3-yl]-amide CHEMBL59097
Type:
Small organic molecule
Emp. Form.:
C20H17ClN4O2
Mol. Mass.:
380.828
SMILES:
Cc1ncccc1Oc1ccc(NC(=O)N2CCc3cc(Cl)ccc23)cn1
: