Target
cAMP-specific 3',5'-cyclic phosphodiesterase 4C
Ligand
BDBM50218247
Substrate
Meas. Tech.
ChEMBL_195884 (CHEMBL799006)
IC50
228±n/a nM
Citation
 Buckley, GCooper, NDyke, HJGalleway, FGowers, LGregory, JCHannah, DRHaughan, AFHellewell, PGKendall, HJLowe, CMaxey, RMontana, JGNaylor, RPicken, CLRuncie, KASabin, VTuladhar, BRWarneck, JB 7-Methoxybenzofuran-4-carboxamides as PDE 4 inhibitors: a potential treatment for asthma. Bioorg Med Chem Lett 10:2137-40 (2000)  
Target
Name:
cAMP-specific 3',5'-cyclic phosphodiesterase 4C
Synonyms:
Dpde1 Pde4c
Type:
PROTEIN
Mol. Mass.:
60038.21
Organism:
Rattus norvegicus
Description:
ChEMBL_104732
Residue:
536
  
Inhibitor
Name:
BDBM50218247
Synonyms:
CHEMBL66798
Type:
Small organic molecule
Emp. Form.:
C19H12Cl2N2O4
Mol. Mass.:
403.216
SMILES:
COc1ccc(C(=O)Nc2c(Cl)cc(cc2Cl)C#N)c2cc(oc12)C(C)=O
: