Target
cAMP-specific 3',5'-cyclic phosphodiesterase 4C
Ligand
BDBM50218250
Substrate
Meas. Tech.
ChEMBL_195884 (CHEMBL799006)
IC50
150±n/a nM
Citation
 Buckley, GCooper, NDyke, HJGalleway, FGowers, LGregory, JCHannah, DRHaughan, AFHellewell, PGKendall, HJLowe, CMaxey, RMontana, JGNaylor, RPicken, CLRuncie, KASabin, VTuladhar, BRWarneck, JB 7-Methoxybenzofuran-4-carboxamides as PDE 4 inhibitors: a potential treatment for asthma. Bioorg Med Chem Lett 10:2137-40 (2000)  
Target
Name:
cAMP-specific 3',5'-cyclic phosphodiesterase 4C
Synonyms:
Dpde1 Pde4c
Type:
PROTEIN
Mol. Mass.:
60038.21
Organism:
Rattus norvegicus
Description:
ChEMBL_104732
Residue:
536
  
Inhibitor
Name:
BDBM50218250
Synonyms:
CHEMBL305176
Type:
Small organic molecule
Emp. Form.:
C18H14Cl2N2O4
Mol. Mass.:
393.221
SMILES:
COc1ccc(C(=O)N(C)c2c(Cl)cncc2Cl)c2cc(oc12)C(C)=O
: