Target
Thioredoxin reductase 3
Ligand
BDBM50218807
Substrate
Meas. Tech.
ChEMBL_210563 (CHEMBL816515)
IC50
>50000±n/a nM
Citation
 Wipf, PHopkins, TDJung, JKRodriguez, SBirmingham, ASouthwick, ECLazo, JSPowis, G New inhibitors of the thioredoxin-thioredoxin reductase system based on a naphthoquinone spiroketal natural product lead. Bioorg Med Chem Lett 11:2637-41 (2001)  
Target
Name:
Thioredoxin reductase 3
Synonyms:
TGR TRXR3 TXNRD3 Thioredoxin reductase 3 | Thioredoxin reductase TR2
Type:
PROTEIN
Mol. Mass.:
70543.23
Organism:
Homo sapiens (Human)
Description:
ChEMBL_104858
Residue:
642
  
Inhibitor
Name:
BDBM50218807
Synonyms:
CHEMBL88438
Type:
Small organic molecule
Emp. Form.:
C26H22O4
Mol. Mass.:
398.4505
SMILES:
CC\C=C\CCOc1cccc2c1C(=O)C=CC21Oc2cccc3cccc(O1)c23
: