Target
Prothrombin
Ligand
BDBM50215308
Substrate
Meas. Tech.
ChEMBL_209399 (CHEMBL811331)
Ki
3.9±n/a nM
Citation
 Cui, JJAraldi, GLReiner, JEReddy, KMKemp, SJHo, JZSiev, DVMamedova, LGibson, TSGaudette, JAMinami, NKAnderson, SMBradbury, AENolan, TGSemple, JE Non-covalent thrombin inhibitors featuring P3-heterocycles with P1-bicyclic arginine surrogates. Bioorg Med Chem Lett 12:2925-30 (2002)  
Target
Name:
Prothrombin
Synonyms:
Activation peptide fragment 1 Coagulation factor II Prothrombin precursor Thrombin heavy chain | Thrombin light chain
Type:
Protein
Mol. Mass.:
70029.57
Organism:
Homo sapiens (Human)
Description:
P00734
Residue:
622
  
Inhibitor
Name:
BDBM50215308
Synonyms:
CHEMBL99185
Type:
Small organic molecule
Emp. Form.:
C24H23N5O5S
Mol. Mass.:
493.535
SMILES:
Cc1ccc(NS(=O)(=O)c2ccc3OCCc3c2)c(=O)n1CC(=O)NCc1ccc2[nH]ncc2c1
: