Target
Prothrombin
Ligand
BDBM50215315
Substrate
Meas. Tech.
ChEMBL_209399 (CHEMBL811331)
Ki
24±n/a nM
Citation
 Cui, JJAraldi, GLReiner, JEReddy, KMKemp, SJHo, JZSiev, DVMamedova, LGibson, TSGaudette, JAMinami, NKAnderson, SMBradbury, AENolan, TGSemple, JE Non-covalent thrombin inhibitors featuring P3-heterocycles with P1-bicyclic arginine surrogates. Bioorg Med Chem Lett 12:2925-30 (2002)  
Target
Name:
Prothrombin
Synonyms:
Activation peptide fragment 1 Coagulation factor II Prothrombin precursor Thrombin heavy chain | Thrombin light chain
Type:
Protein
Mol. Mass.:
70029.57
Organism:
Homo sapiens (Human)
Description:
P00734
Residue:
622
  
Inhibitor
Name:
BDBM50215315
Synonyms:
CHEMBL100843
Type:
Small organic molecule
Emp. Form.:
C25H27N5O2
Mol. Mass.:
429.5142
SMILES:
CCc1cnc(NCCc2ccccc2)c(=O)n1CC(=O)NCc1ccc2[nH]ccc2c1
: