Target
cAMP-specific 3',5'-cyclic phosphodiesterase 4C
Ligand
BDBM50221000
Substrate
Meas. Tech.
ChEMBL_157228 (CHEMBL769552)
IC50
4.9±n/a nM
Citation
 Kim, EChun, HOJung, SHKim, JHLee, JMSuh, BCXiang, MXRhee, CK Improvement of therapeutic index of phosphodiesterase type IV inhibitors as anti-Asthmatics. Bioorg Med Chem Lett 13:2355-8 (2003)  
Target
Name:
cAMP-specific 3',5'-cyclic phosphodiesterase 4C
Synonyms:
Dpde1 Pde4c
Type:
PROTEIN
Mol. Mass.:
60038.21
Organism:
Rattus norvegicus
Description:
ChEMBL_104732
Residue:
536
  
Inhibitor
Name:
BDBM50221000
Synonyms:
CHEMBL431962
Type:
Small organic molecule
Emp. Form.:
C22H26N2O3
Mol. Mass.:
366.4534
SMILES:
CCC(=O)N\N=C(/c1ccccc1)c1ccc(OC)c(OC2CCCC2)c1
: