Target
Delta-type/Kappa-type/Mu-type opioid receptor
Ligand
BDBM50026752
Substrate
Meas. Tech.
ChEMBL_147481 (CHEMBL755153)
IC50
500±n/a nM
Citation
 Reifenrath, WGRoche, EBAl-Turk, WAJohnson, HL Synthesis and biological activity of fluoroalkylamine derivatives of narcotic analgesics. J Med Chem 23:985-90 (1980)  
Target
Name:
Delta-type/Kappa-type/Mu-type opioid receptor
Synonyms:
Opioid receptors; mu/kappa/delta
Type:
Mol. Mass.:
Description:
ASSAY_ID of ChEMBL is 357797
Components:
This complex has 3 components.
Component 1
Name:
Mu-type opioid receptor
Synonyms:
M-OR-1 MOR-1 MUOR1 Mu opiate receptor OPRM1 hMOP | mu-type opioid receptor isoform MOR-1
Type:
G Protein-Coupled Receptor (GPCR)
Mol. Mass.:
44789.51
Organism:
Homo sapiens (Human)
Description:
P35372
Residue:
400
  
Component 2
Name:
Kappa-type opioid receptor
Synonyms:
K-OR-1 Kappa-opioid receptor (KOR) Kappa-type opioid receptor (KOR) OPIATE Kappa OPRK1 kappa opioid receptor (KOR)
Type:
G Protein-Coupled Receptor (GPCR)
Mol. Mass.:
42648.76
Organism:
Homo sapiens (Human)
Description:
P41145
Residue:
380
  
Component 3
Name:
Delta-type opioid receptor
Synonyms:
D-OR-1 Delta opioid receptor OPIATE Delta OPRD1 OPRK1 | opioid receptor, delta 1
Type:
G Protein-Coupled Receptor (GPCR)
Mol. Mass.:
40382.98
Organism:
Homo sapiens (Human)
Description:
Competition binding assays were carried out using membrane preparations from transfected HN9.10 cells that constitutively expressed the delta opioid receptor.
Residue:
372
  
Inhibitor
Name:
BDBM50026752
Synonyms:
1-Methyl-4-phenyl-piperidine-4-carboxylic acid ethyl ester 4-Ethoxycarbonyl-1-methyl-4-phenyl-piperidinium Demerol MEPERIDINE HYDROCHLORIDE Pethidine | ethyl 1-methyl-4-phenylpiperidine-4-carboxylate
Type:
Small organic molecule
Emp. Form.:
C15H21NO2
Mol. Mass.:
247.3327
SMILES:
CCOC(=O)C1(CCN(C)CC1)c1ccccc1
: