Target
Voltage-dependent L-type calcium channel subunit alpha-1S
Ligand
BDBM50101817
Substrate
Meas. Tech.
ChEMBL_53180 (CHEMBL664575)
IC50
1.7±n/a nM
Citation
 Taylor, MDBadger, EWSteffen, RPHaleen, SJPugsley, TAShih, YHWeishaar, RE 2-(2-Aryl-2-oxoethylidene)-1,2,3,4-tetrahydropyridines. Novel isomers of 1,4-dihydropyridine calcium channel blockers. J Med Chem 31:1659-64 (1988)  
Target
Name:
Voltage-dependent L-type calcium channel subunit alpha-1S
Synonyms:
CAC1S_RAT Cacn1 Cacnl1a3 Cchl1a3 Voltage-gated L-type calcium channel Voltage-gated calcium channel subunit alpha Cav1.1
Type:
PROTEIN
Mol. Mass.:
210392.58
Organism:
Rattus norvegicus
Description:
ChEMBL_92777
Residue:
1850
  
Inhibitor
Name:
BDBM50101817
Synonyms:
Adalat Afeditab Cr CHEBI:7565 Procardia | Procardia Xl
Type:
Small organic molecule
Emp. Form.:
C17H18N2O6
Mol. Mass.:
346.3346
SMILES:
COC(=O)C1=C(C)NC(C)=C(C1c1ccccc1[N+]([O-])=O)C(=O)OC
: