Target
Voltage-dependent L-type calcium channel subunit alpha-1S
Ligand
BDBM50227620
Substrate
Meas. Tech.
ChEMBL_53180 (CHEMBL664575)
IC50
150±n/a nM
Citation
 Taylor, MDBadger, EWSteffen, RPHaleen, SJPugsley, TAShih, YHWeishaar, RE 2-(2-Aryl-2-oxoethylidene)-1,2,3,4-tetrahydropyridines. Novel isomers of 1,4-dihydropyridine calcium channel blockers. J Med Chem 31:1659-64 (1988)  
Target
Name:
Voltage-dependent L-type calcium channel subunit alpha-1S
Synonyms:
CAC1S_RAT Cacn1 Cacnl1a3 Cchl1a3 Voltage-gated L-type calcium channel Voltage-gated calcium channel subunit alpha Cav1.1
Type:
PROTEIN
Mol. Mass.:
210392.58
Organism:
Rattus norvegicus
Description:
ChEMBL_92777
Residue:
1850
  
Inhibitor
Name:
BDBM50227620
Synonyms:
CHEMBL295579
Type:
Small organic molecule
Emp. Form.:
C21H21F3N2O4
Mol. Mass.:
422.3976
SMILES:
CCOC(=O)CC1=NC(C)=C(C#N)C(\C1=C(/O)OCC)c1ccccc1C(F)(F)F
: