Target
Similar to alpha-tubulin isoform 1
Ligand
BDBM50009568
Substrate
Meas. Tech.
ChEMBL_39798 (CHEMBL876771)
IC50
1400±n/a nM
Citation
 Cushman, MNagarathnam, DGopal, DChakraborti, AKLin, CMHamel, E Synthesis and evaluation of stilbene and dihydrostilbene derivatives as potential anticancer agents that inhibit tubulin polymerization. J Med Chem 34:2579-88 (1991)  
Target
Name:
Similar to alpha-tubulin isoform 1
Synonyms:
Similar to alpha-tubulin isoform 1
Type:
PROTEIN
Mol. Mass.:
10383.05
Organism:
Bos taurus
Description:
ChEMBL_104716
Residue:
99
  
Inhibitor
Name:
BDBM50009568
Synonyms:
(Thiocolchicine)N-(1,2,3-Trimethoxy-10-methylsulfanyl-9-oxo-5,6,7,9-tetrahydro-benzo[a]heptalen-7-yl)-acetamide N-((S)-1,2,3-Trimethoxy-10-methylsulfanyl-9-oxo-5,6,7,9-tetrahydro-benzo[a]heptalen-7-yl)-acetamide N-(1,2,3-Trimethoxy-10-methylsulfanyl-9-oxo-5,6,7,9-tetrahydro-benzo[a]heptalen-7-yl)-acetamide (Thiocolchicine) THIOCOLCHICINE
Type:
Small organic molecule
Emp. Form.:
C22H25NO5S
Mol. Mass.:
415.503
SMILES:
COc1cc2CC[C@H](NC(C)=O)c3cc(=O)c(SC)ccc3-c2c(OC)c1OC
: